{"text_format":"1","workbook":"xlsx","n_sheets":7,"sheets":["SIMULADOR BONUS","NORMATIVA","VALORES LÍMITE DE LOS ÍNDICES","PERÍODO DE OBSERVACIÓN","CUANTÍA DEL INCENTIVO","ÍNDICES DE SINIESTRALIDAD","Índices"],"not_rendered":{"charts":0,"images":20,"macros":1,"external_links":0,"defined_names":6,"comments":1,"pivot_tables":0},"unopened":[],"bounds":{"document_bytes":16777216,"sheet_cells":100000,"rows_first":2000,"rows_last":500,"rows_between":2000,"halvings":0,"cell_chars":16384,"cell_head_chars":4096},"cells_cut":0,"cells_raw":0,"read":"whole","date_system":"1900"}

{"sheet":"SIMULADOR BONUS","index":0,"n_rows":27,"n_cols":6,"rows_kept":27,"cut":false,"hidden":false,"merged":[[26,1,29,3],[22,1,22,2],[23,1,23,2],[24,1,24,2],[17,1,17,3],[19,1,19,2],[21,1,21,3],[20,1,20,2],[18,1,18,2],[15,1,15,2],[6,1,6,2],[7,1,7,2],[8,1,8,2],[10,1,13,1],[0,1,0,3],[14,1,14,2],[4,1,4,2],[5,1,5,3],[2,1,2,3],[9,1,9,2],[1,1,1,2]]}
[]
[null,"      SIMULADOR DE AYUDA PARA LA SOLICITUD DEL INCENTIVO BONUS (LA SOLICITUD SE TRAMITA DESDE EL 15 DE ABRIL HASTA EL 31 DE MAYO 2019)"]
[null,"Según lo regulado por el Real Decreto 231/2017 y la Orden TMS/83/2019, se puede obtener una estimación de:\n-El valor máximo del importe total de la prestación por incapacidad temporal derivada de contingencias profesionales durante el período de observación, excluidos los accidentes in itinere.\n-El valor máximo del número total de partes de AT y EP con baja laboral durante el periodo de observación, excluidos los accidentes in itinere.\n-El valor máximo del número total de reconocimientos de pensiones de incapacidad permanente derivados de contingencias profesionales y de fallecimientos, en el período de observación, excluidos los accidentes in itinere.\nNOTA: Cumplimente los campos en amarillo."]
[]
[null," Seleccione el CNAE de cotización de la empresa",null,null,null,"CLICA PARA LEER NOTA"]
[null,{"$f":"IF(D5=0,\"\",VLOOKUP($D$5,Índices!C:D,2,FALSE))","v":""}]
[null,"Valor límite del índice de siniestralidad general - Ii",null,{"$f":"IF(D5=0,\"\",VLOOKUP($D$5,Índices!$C:$G,3,FALSE))","v":""}]
[null,"Valor límite del índice de siniestralidad general - IIi",null,{"$f":"IF(D5=0,\"\",VLOOKUP($D$5,Índices!$C:$G,4,FALSE))","v":""}]
[null,"Valor límite del índice de siniestralidad extrema - IIIi",null,{"$f":"IF(D5=0,\"\",VLOOKUP($D$5,Índices!$C:$G,5,FALSE))","v":""}]
[null,"Seleccione el último año en el que presentó la solicitud del incentivo"]
[null,"Introduzca las cuotas por contingencias profesionales desde 2018, hasta alcanzar el volumen mínimo de cotización requerido",2018]
[null,null,2017,null,{"$f":"IF(OR(Años=\"2018\",D11>5000),\"No procede\",\"\")","v":""}]
[null,null,2016,null,{"$f":"IF(OR(Años=\"2017\",E12=\"No procede\",SUM(D11+D12)>5000),\"No procede\",\"\")","v":""}]
[null,null,2015,null,{"$f":"IF(OR(Años=\"2016\",E13=\"No procede\",SUM(D11+D12+D13)>5000),\"No procede\",\"\")","v":""}]
[null,"Período de observación",null,{"$f":"IF(D11=\"\",\"\",IF(D16=\"COTIZACIÓN INSUFICIENTE\",\"No procede\",IF(E12=\"No procede\",C11,IF(E13=\"No procede\",CONCATENATE(C11,\"-\",C12),IF(E14=\"No procede\",CONCATENATE(C11,\"-\",C12,\"-\",C13),CONCATENATE(C11,\"-\",C12,\"-\",C13,\"-\",C14))))))","v":""}]
[null,"Total de cuotas por contingencias profesionales para el período de observación",null,{"$f":"IF(COUNTA(D5)<1,\"\",IF(COUNTA(Años)<1,\"\",IF(COUNTA(Cotizacion)<1,\"\",IF(E12=\"No procede\",IF(D11>5000,D11,\"COTIZACIÓN INSUFICIENTE\"),IF(AND(E12=\"\",E13=\"No procede\"),IF((D11+D12)>5000,(D11+D12),\"COTIZACIÓN INSUFICIENTE\"),IF(AND(E12=\"\",E13=\"\",E14=\"No procede\"),IF((D11+D12+D13)>5000,(D11+D12+D13),\"COTIZACIÓN INSUFICIENTE\"),IF(AND(E12=\"\",E13=\"\",E14=\"\",D11+D12+D13+D14>=250,COUNTA(Cotizacion)=4),(D11+D12+D13+D14),\"COTIZACIÓN INSUFICIENTE\")))))))","v":""}]
[]
[null,"Estimación de la cuantía del incentivo a solicitar si se cumplieran los requisitos establecidos"]
[null,"El 5% del importe de las cuotas por contingencias profesionales sería:",null,{"$f":"IF(OR(COUNT(Cotización)=0,D16=\"\"),\"\",IF(D16=\"COTIZACIÓN INSUFICIENTE\",\"\",D16*0.05))","v":""}]
[null,"El incentivo adicional de hasta el 5% de las cuotas, con el límite máximo de las inversiones en acciones complementarias sería: ",null,{"$f":"D19","v":""}]
[null,"La cuantía máxima del incentivo a solicitar si se cumplieran los requisitos sería:",null,{"$f":"IF(D19=\"\",\"\",D19+D20)","v":""}]
[null,"Estimación de los valores máximos para cumplir con los índices de siniestralidad general y extrema"]
[null,"I Importe máximo de la prestación por incapacidad temporal derivada de contingencias profesionales durante el período de observación, excluidos los accidentes in itinere sería:",null,{"$f":"IF(OR(COUNT(Cotizacion)=0,D16=\"\"),\"\",IF(D16=\"COTIZACIÓN INSUFICIENTE\",\"\",(D7*$D$16/100)-0.5))","v":""}]
[null,"II Número máximo de partes de AT y EP con baja laboral durante el periodo de observación, excluidos los accidentes in itinere, sería:",null,{"$f":"IF(OR(D8=\"\",,D16=\"\",D16=\"COTIZACIÓN INSUFICIENTE\"),\"\",INT(D8*$D$16/10000))","v":""}]
[null,"III Número máximo de reconocimientos de pensiones de incapacidad permanente derivados de contingencias profesionales y de fallecimientos, en el período de observación, excluidos los accidentes in itinere, sería: ",null,{"$f":"IF(OR(D9=\"\",D16=\"\",D16=\"COTIZACIÓN INSUFICIENTE\"),\"\",INT(D9*$D$16/1000000))","v":""}]
[]
[null,"Si es usuario de                              , en el apartado Previsión Bonus puede acceder a los últimos datos disponibles para la gestión de la solicitud."]

{"sheet":"NORMATIVA","index":1,"n_rows":4,"n_cols":1,"rows_kept":4,"cut":false,"hidden":false,"merged":[[2,0,2,2],[0,0,0,1],[3,0,3,2]]}
["      Simulador BONUS 2018"]
["NORMATIVA APLICABLE:"]
["Real Decreto 231/2017, de 10 de marzo, por el que se regula el establecimiento de un sistema de reducción de las cotizaciones por contingencias profesionales a las empresas que hayan disminuido de manera considerable la siniestralidad laboral."]
["Orden TMS/83/2019, de 31 de enero, por la que se desarrollan las normas legales de cotización a la Seguridad Social, desempleo, protección por cese de actividad, Fondo de Garantía Salarial y formación profesional para el ejercicio 2019."]

{"sheet":"VALORES LÍMITE DE LOS ÍNDICES","index":2,"n_rows":1,"n_cols":1,"rows_kept":1,"cut":false,"hidden":false,"merged":[[0,0,0,5]]}
["      Simulador BONUS 2018"]

{"sheet":"PERÍODO DE OBSERVACIÓN","index":3,"n_rows":1,"n_cols":1,"rows_kept":1,"cut":false,"hidden":false,"merged":[[0,0,0,5]]}
["      Simulador BONUS 2018"]

{"sheet":"CUANTÍA DEL INCENTIVO","index":4,"n_rows":1,"n_cols":1,"rows_kept":1,"cut":false,"hidden":false,"merged":[[0,0,0,5]]}
["      Simulador BONUS 2018"]

{"sheet":"ÍNDICES DE SINIESTRALIDAD","index":5,"n_rows":1,"n_cols":1,"rows_kept":1,"cut":false,"hidden":false,"merged":[[0,0,0,5]]}
["      Simulador BONUS 2018"]

{"sheet":"Índices","index":6,"n_rows":153,"n_cols":7,"rows_kept":153,"cut":false,"hidden":true,"merged":[]}
["CNAE (DIV)","CNAE (SUB)","CNAE (cot)","Descripción","II1 limite","II2 limite","II3 limite"]
[1,0,"01","Agricultura, ganadería, caza y servicios relacionados con las mismas (excepto 0113, 0119, 0129, 0130, 014, 0147, 015, 016, 0164 y 017)",5.98,0.54,0.33]
[1,13,"0113","Cultivo de hortalizas, raíces y tubérculos",5.98,0.54,0.33]
[1,19,"0119","Otros cultivos no perennes",5.98,0.54,0.33]
[1,29,"0129","Otros cultivos perennes",12.75,1.1499999999999999,0.72]
[1,30,"0130","Propagación de plantas",5.98,0.54,0.33]
[1,40,"014","Producción ganadera (excepto 0147)",7.91,0.72,0.45]
[1,47,"0147","Avicultura",5.98,0.54,0.33]
[1,50,"015","Producción agrícola combinada con la producción ganadera",7.91,0.72,0.45]
[1,60,"016","Actividades de apoyo a la agricultura, a la ganadería y de preparación posterior a la cosecha (excepto 0164)",7.91,0.72,0.45]
[1,64,"0164","Tratamiento de semillas para reproducción",5.98,0.54,0.33]
[1,70,"017","Caza, captura de animales y servicios relacionados con las mismas.",7.91,0.72,0.45]
[2,0,"02","Silvicultura y explotación forestal",12.75,1.1499999999999999,0.72]
[3,0,"03","Pesca y acuicultura (excepto 0322)",17.53,1.58,0.99]
[3,22,"0322","Acuicultura en agua dulce",17.53,1.58,0.99]
[5,0,"05","Extracción de antracita, hulla y lignito",19.329999999999998,1.75,1.0900000000000001]
[6,0,"06","Extracción de crudo de petróleo y gas natural",17.53,1.58,0.99]
[7,0,"07","Extracción de minerales metálicos",12.75,1.1499999999999999,0.72]
[8,0,"08","Otros industrias extractivas (excepto 0811)",12.75,1.1499999999999999,0.72]
[8,11,"0811","Extracción de piedra ornamental y para la construcción, piedra caliza, yeso, creta y pizarra",19.329999999999998,1.75,1.0900000000000001]
[9,0,"09","Actividades de apoyo a las industrias extractivas",12.75,1.1499999999999999,0.72]
[10,0,"10","Industria de la alimentación (excepto 101, 102, 106, 107 y 108)",7.91,0.72,0.45]
[10,10,"101","Procesado y conservación de carne y elaboración de carne y elaboración de productos cárnicos",12.21,1.1100000000000001,0.69]
[10,20,"102","Procesado y conservación de pescados, crustáceos y moluscos",7.91,0.72,0.45]
[10,60,"106","Fabricación de productos de molinería, almidones y productos amiláceos",7.91,0.72,0.45]
[10,70,"107","Fabricación de productos de panadería y pastas alimenticios",5.98,0.54,0.33]
[10,80,"108","Fabricación de otros productos alimenticios",5.98,0.54,0.33]
[11,0,"11","Fabricación de bebidas",7.91,0.72,0.45]
[12,0,"12","Industria del tabaco",5.98,0.54,0.33]
[13,0,"13","Industria textil (excepto 1391)",5.98,0.54,0.33]
[13,91,"1391","Fabricación de tejidos de punto",5.98,0.54,0.33]
[14,0,"14","Confección de prendas de vestir (excepto 1411, 1420 y 143)",3.98,0.36,0.22]
[14,11,"1411","Confección de prendas de vestir de cuero",5.98,0.54,0.33]
[14,20,"1420","Fabricación de artículos de peletería",5.98,0.54,0.33]
[14,30,"143","Confección de prendas de vestir de punto",5.98,0.54,0.33]
[15,0,"15","Industria del cuero y del calzado",5.98,0.54,0.33]
[16,0,"16","Industria de la madera y del corcho, excepto muebles; cestería y espartería (excepto 1624 y 1629)",12.75,1.1499999999999999,0.72]
[16,24,"1624","Fabricación de envases y embalajes de madera",12.21,1.1100000000000001,0.69]
[16,29,"1629","Fabricación de otros productos de madera; artículos de corcho, cestería y espartería",12.21,1.1100000000000001,0.69]
[17,0,"17","Industria del papel (excepto 171)",5.98,0.54,0.33]
[17,10,"171","Fabricación de pasta papelera, papel y cartón",7.91,0.72,0.45]
[18,0,"18","Artes gráficas y reproducción de soportes grabados",5.98,0.54,0.33]
[19,0,"19","Coquerías y refino de petróleo",5.98,0.54,0.33]
[20,0,"20","Industria química (excepto 204 y 206)",7.91,0.72,0.45]
[20,40,"204","Fabricación de jabones, detergentes y otros artículos de limpieza y abrillantamiento; fabricación de perfumes y cosméticos",5.98,0.54,0.33]
[20,60,"206","Fabricación de fibras artificiales y sintéticas",5.98,0.54,0.33]
[21,0,"21","Fabricación de productos farmacéuticos",5.98,0.54,0.33]
[22,0,"22","Fabricación de productos de caucho y plástico",7.91,0.72,0.45]
[23,0,"23","Fabricación de otros productos minerales no metálicos (excepto 231, 232, 2331, 234 y 237)",12.21,1.1100000000000001,0.69]
[23,10,"231","Fabricación de vidrio y productos de vidrio",7.91,0.72,0.45]
[23,20,"232","Fabricación de productos cerámicos refractarios",7.91,0.72,0.45]
[23,31,"2331","Fabricación de azulejos y baldosas de cerámica",7.91,0.72,0.45]
[23,40,"234","Fabricación de otros productos cerámicos",7.91,0.72,0.45]
[23,70,"237","Corte, tallado y acabado de la piedra",17.53,1.58,0.99]
[24,0,"24","Metalurgia; fabricación de productos de hierro, acero y ferroleaciones",12.21,1.1100000000000001,0.69]
[25,0,"25","Fabricación de productos metálicos, excepto maquinaria y equipo",12.21,1.1100000000000001,0.69]
[26,0,"26","Fabricación de productos informáticos, electrónicos y ópticos",7.91,0.72,0.45]
[27,0,"27","Fabricación de material y equipo eléctrico",7.91,0.72,0.45]
[28,0,"28","Fabricación de maquinaria y equipo n.c.o.p.",12.21,1.1100000000000001,0.69]
[29,0,"29","Fabricación de vehículos a motor, remolques y semirremolques",7.91,0.72,0.45]
[30,0,"30","Fabricación de otro material de transporte (excepto 3091 y 3092)",12.21,1.1100000000000001,0.69]
[30,91,"3091","Fabricación de motocicletas",7.91,0.72,0.45]
[30,92,"3092","Fabricación de bicicletas y de vehículos para personas con discapacidad",7.91,0.72,0.45]
[31,0,"31","Fabricación de muebles",12.21,1.1100000000000001,0.69]
[32,0,"32","Otra industria manufacturera (excepto 321 y 322)",7.91,0.72,0.45]
[32,10,"321","Fabricación de artículos de joyería y artículos similares",5.98,0.54,0.33]
[32,20,"322","Fabricación de instrumentos musicales",5.98,0.54,0.33]
[33,0,"33","Reparación e instalación de maquinaria y equipo (excepto 3313 y 3314)",12.21,1.1100000000000001,0.69]
[33,13,"3313","Reparación de equipos electrónicos y ópticos",7.91,0.72,0.45]
[33,14,"3314","Reparación de equipos eléctricos",7.91,0.72,0.45]
[35,0,"35","Suministro de energía eléctrica, gas, vapor y aire acondicionado",7.91,0.72,0.45]
[36,0,"36","Captación, depuración y distribución de agua",7.91,0.72,0.45]
[37,0,"37","Recogida y tratamiento de aguas residuales",7.91,0.72,0.45]
[38,0,"38","Recogida tratamiento y eliminación de residuos; valorización",7.91,0.72,0.45]
[39,0,"39","Actividades de descontaminación y otros servicios de gestión de residuos",7.91,0.72,0.45]
[41,0,"41","Construcción de edificios (excepto 411)",17.53,1.58,0.99]
[41,10,"411","Promoción inmobiliaria",5.98,0.54,0.33]
[42,0,"42","Ingeniería civil",17.53,1.58,0.99]
[43,0,"43","Actividades de construcción especializada",17.53,1.58,0.99]
[45,0,"45","Venta y reparación de vehículos de motor y motocicletas (excepto 452 y 454)",5.98,0.54,0.33]
[45,20,"452","Mantenimiento y reparación de vehículos de motor",12.21,1.1100000000000001,0.69]
[45,40,"454","Venta, mantenimiento y reparación de motocicletas y de sus repuestos y accesorios",7.91,0.72,0.45]
[46,0,"46","Comercio al por mayor e intermediarios del comercio excepto de vehículos de motor y motocicletas (excepto 4623, 4624, 4632, 4638, 4672, 4673, 4674, 4677 y 4690)",7.91,0.72,0.45]
[46,23,"4623","Comercio al por mayor de animales vivos",7.91,0.72,0.45]
[46,24,"4624","Comercio al por mayor de cueros y pieles",7.91,0.72,0.45]
[46,32,"4632","Comercio al por mayor de carne y productos cárnicos",7.91,0.72,0.45]
[46,38,"4638","Comercio al por mayor de pescados, mariscos y otros productos alimenticios",7.91,0.72,0.45]
[46,72,"4672","Comercio al por mayor de metales y minerales metálicos",7.91,0.72,0.45]
[46,73,"4673","Comercio al por mayor de madera, materiales de construcción y aparatos sanitarios",7.91,0.72,0.45]
[46,74,"4674","Comercio al por mayor de ferretería, fontanería y calefacción",7.91,0.72,0.45]
[46,77,"4677","Comercio al por mayor de chatarra y productos de desecho",7.91,0.72,0.45]
[46,90,"4690","Comercio al por mayor no especializado",7.91,0.72,0.45]
[47,0,"47","Comercio al por menor, excepto de vehículos de motor y motocicletas (excepto 473)",5.98,0.54,0.33]
[47,30,"473","Comercio al por menor de combustible para la automoción en establecimientos especializados",5.98,0.54,0.33]
[49,0,"49","Transporte terrestre y por tubería (excepto 494)",7.91,0.72,0.45]
[49,40,"494","Transporte de mercancías por carretera y servicios de mudanza",7.91,0.72,0.45]
[50,0,"50","Transporte marítimo y por vías navegables interiores",12.21,1.1100000000000001,0.69]
[51,0,"51","Transporte aéreo",7.91,0.72,0.45]
[52,0,"52","Almacenamiento y actividades anexas al transporte (excepto 5221)",7.91,0.72,0.45]
[52,21,"5221","Actividades anexas al transporte terrestre",5.98,0.54,0.33]
[53,0,"53","Actividades postales y de correos",5.98,0.54,0.33]
[55,0,"55","Servicios de alojamiento",3.98,0.36,0.22]
[56,0,"56","Servicios de comidas y bebidas",3.98,0.36,0.22]
[58,0,"58","Edición",5.98,0.54,0.33]
[59,0,"59","Actividades cinematográficas, de vídeo y de programas de televisión, grabación de sonido y edición musical",3.98,0.36,0.22]
[60,0,"60","Actividades de programación y emisión de radio y televisión",3.98,0.36,0.22]
[61,0,"61","Telecomunicaciones",5.98,0.54,0.33]
[62,0,"62","Programación, consultoría y otras actividades relacionadas con la informática",5.98,0.54,0.33]
[63,0,"63","Servicio de información (excepto 6391)",5.98,0.54,0.33]
[63,91,"6391","Actividades de las agencias de noticias",3.98,0.36,0.22]
[64,0,"64","Servicios financieros, excepto seguros y fondos de pensiones",3.98,0.36,0.22]
[65,0,"65","Seguros, reaseguros y fondos de pensión, excepto Seguridad Social obligatoria",3.98,0.36,0.22]
[66,0,"66","Actividades auxiliares a los servicios financieros y a los seguros",3.98,0.36,0.22]
[68,0,"68","Actividades inmobiliarias",5.98,0.54,0.33]
[69,0,"69","Actividades jurídicas y de contabilidad",3.98,0.36,0.22]
[70,0,"70","Actividades de las sedes centrales; actividades de consultoría de gestión empresarial",3.98,0.36,0.22]
[71,0,"71","Servicios técnicos de arquitectura e ingeniería; ensayos y análisis técnicos",5.98,0.54,0.33]
[72,0,"72","Investigación y desarrollo",5.98,0.54,0.33]
[73,0,"73","Publicidad y estudio de mercado",5.98,0.54,0.33]
[74,0,"74","Otras actividades profesionales, científicas y técnicas (excepto 742)",5.98,0.54,0.33]
[74,20,"742","Actividades de fotografía",3.98,0.36,0.22]
[75,0,"75","Actividades veterinarias",5.98,0.54,0.33]
[77,0,"77","Actividades de alquiler",5.98,0.54,0.33]
[78,0,"78","Actividades relacionadas con el empleo (excepto 781)",5.98,0.54,0.33]
[78,10,"781","Actividades de las agencias de colocación",5.98,0.54,0.33]
[79,0,"79","Actividades de las agencias de viajes, operadores turísticos, servicios de reservas y actividades relacionadas con los mismos",5.98,0.54,0.33]
[80,0,"80","Actividades de seguridad e investigación",7.91,0.72,0.45]
[81,0,"81","Servicios a edificios y actividades de jardinería (excepto 811)",7.91,0.72,0.45]
[81,10,"811","Servicios integrales a edificios e instalaciones",5.98,0.54,0.33]
[82,0,"82","Actividades administrativas de oficina y otras actividades auxiliares a las empresas (excepto 8220 y 8292)",5.98,0.54,0.33]
[82,20,"8220","Actividades de los centros de llamadas",5.98,0.54,0.33]
[82,92,"8292","Actividades de envasado y empaquetado",7.91,0.72,0.45]
[84,0,"84","Administración pública y defensa; Seguridad Social obligatoria (excepto 842)",5.98,0.54,0.33]
[84,20,"842","Prestaciones de servicios a la comunidad en general",7.91,0.72,0.45]
[85,0,"85","Educación",3.98,0.36,0.22]
[86,0,"86","Actividades sanitarias (excepto 869)",5.98,0.54,0.33]
[86,9,869,"Otras actividades sanitarias",5.98,0.54,0.33]
[87,0,"87","Asistencia en establecimientos residenciales",5.98,0.54,0.33]
[88,0,"88","Actividades de servicios sociales sin alojamiento",5.98,0.54,0.33]
[90,0,"90","Actividades de creación, artística y espectáculos",3.98,0.36,0.22]
[91,0,"91","Actividades de bibliotecas, archivos, museos y otras actividades culturales (excepto 9104)",3.98,0.36,0.22]
[91,4,"9104","Actividades de los jardines botánicos, parques zoológicos y reservas naturales",7.91,0.72,0.45]
[92,0,"92","Actividades de juegos de azar y apuestas",3.98,0.36,0.22]
[93,0,"93","Actividades deportivas, recreativas y de entretenimiento",7.91,0.72,0.45]
[94,0,"94","Actividades asociativas",5.98,0.54,0.33]
[95,0,"95","Reparación de ordenadores, efectos personales y artículos de uso doméstico (excepto 9524)",7.91,0.72,0.45]
[95,24,"9524","Reparación de muebles y artículos de menaje",12.21,1.1100000000000001,0.69]
[96,0,"96","Otros servicios personales (excepto 9602, 9603 y 9609)",5.98,0.54,0.33]
[96,2,"9602","Peluquería y otros tratamientos de belleza",3.98,0.36,0.22]
[96,3,"9603","Pompas fúnebres y actividades relacionadas",7.91,0.72,0.45]
[96,9,"9609","Otros servicios personales n.c.o.p.",5.98,0.54,0.33]
[97,0,"97","Actividades de los hogares como empleadores de personal doméstico",3.98,0.36,0.22]
[99,0,"99","Actividades de organizaciones y organismos extraterritoriales",5.98,0.54,0.33]